{"text_format":"1","workbook":"xlsx","n_sheets":5,"sheets":["A","B","C","D","Info"],"not_rendered":{"charts":0,"images":2,"macros":1,"external_links":0,"defined_names":22,"comments":3,"pivot_tables":0},"unopened":[],"bounds":{"document_bytes":16777216,"sheet_cells":100000,"rows_first":2000,"rows_last":500,"rows_between":2000,"halvings":0,"cell_chars":16384,"cell_head_chars":4096},"cells_cut":0,"cells_raw":0,"read":"whole","date_system":"1900"}

{"sheet":"A","index":0,"n_rows":80,"n_cols":31,"rows_kept":80,"cut":false,"hidden":false,"merged":[[0,21,1,24],[6,21,6,22],[8,11,8,17],[9,11,9,17],[2,21,2,24],[5,21,5,22],[3,23,3,24],[4,23,4,24],[2,7,2,11],[8,22,8,24],[5,23,5,24],[5,18,5,20],[6,19,6,20],[2,12,2,20],[4,7,4,8],[3,11,3,17],[24,7,24,9],[23,7,23,9],[13,12,13,13],[5,7,5,8],[12,7,14,9],[7,11,7,16],[3,21,3,22],[4,21,4,22],[4,19,4,20],[4,11,4,14],[5,16,5,17],[5,11,5,14],[6,17,6,18],[9,22,9,24],[6,11,6,14],[7,22,7,24],[49,11,49,13],[33,12,33,13],[21,12,21,13],[14,12,14,13],[19,12,19,13],[35,11,35,13],[12,12,12,13],[62,13,62,15],[63,13,63,15],[63,11,63,12],[50,11,50,13],[51,7,51,17],[52,12,52,20],[61,13,61,15],[61,20,61,22],[59,22,59,23],[54,7,55,8],[57,12,57,20],[56,7,57,8],[52,21,57,24],[53,12,53,20],[54,12,54,20],[61,11,61,12],[49,7,49,8],[52,7,53,8],[56,12,56,20],[55,12,55,20],[15,7,19,9],[25,7,31,9],[29,11,29,13],[32,7,34,8],[32,11,32,13],[34,11,34,13],[31,12,31,13],[18,12,18,13],[20,12,20,13],[30,11,30,13],[22,11,22,13],[23,11,23,13]]}
[]
[null,null,null,null," ",null,null,null,null,null,null,null,null,null,null,null,null,null,null,"\n\n"]
[null,null,null,null,null,null,null,null,null,null,null,null," Travel Expenses Claim from 22.06.2018"]
[null,null,null,null,null,null,null,"Last name and First name",null,null,null,null,null,null,null,null,null,null,"National Norwegian ID no. (if applicable)",null,null,"Employee number (if applicable)"]
[null,null,null,null,null,null,null,"Home address",null,null,null,null,null,null,null,null,"Postal code",null,"City"]
[null,null,null,null,null,null,null,"Position",null,null,null,null,null,null,null,null,"Bank account"]
[null,null,null,null,null,null,null,"Organization/Institution",null,null,null,null,null,null,null,null,null,null,null,null,null,null,null,null,null,null,"Test på dato"]
[null,null,null,null,null,null,null,"Type of travel",null,null,null,null,null,null,null,null,null,"Region",null,"Date","Time",null,{"$f":"IF(AND(AC28=1,AC34=10),\"Har ikke krav på komp.tillegg\",IF(AND(AC28>1,AC35=20),\"Antall komp.till. er for høyt\",\"\"))","v":""},null,null,null,{"$f":"IF(AND(T9<>\"\",T10<>\"\"),-1,1)","v":1},"Verdien 1 dersom fra og tildato er tomme"]
[null,null,null,null,null,null,null,"Destination",null,null,null,null,null,null,null,null,null,null,"Departure",null,null,"No of days",{"$f":"IF(AA18<0,\"The number of days for which subsist. all. is claimed is too high\",\"\")","v":""},null,null,null,{"$f":"IF(OR($T$9<42005,$T$9>42369),0,1)","v":0},"hvis 1 er utreise dato dato innen 2015"]
[null,null,null,null,null,null,null,"Purpose of trip",null,null,null,null,null,null,null,null,null,null,"Return",null,null,{"$f":"IF(AA8=1,0,IF(T9>T10,\"Sjekk dato\",T10-T9+AA15))","v":0},{"$f":"IF(AA8<>1,IF(AND(AA11<2,AA11>0),\"Satser for reise er fra 2015\",\"\"),\"\")","v":""},null,null,null,{"$f":"IF(OR($T$10<42005,$T$10>42369),0,1)","v":0},"hvis 1 er returreise innen 2015"]
[null,null,null,null,null,null,null,"Travel expenses/compensation",null,null,null,null,null,null,null,null,"Number","Rate","Amount","Account","Cost center","K-elem.4","K-elem.5","K-elem.6","K-elem.7",null,{"$f":"SUM(AA9:AA10)","v":0},"hvis 2 er utreise og retur innen 2015"]
[null,null,null,null,null,null,null,null,null,null,1041,"Transferred from reverse ",null,null,null,null,"              ",null,{"$f":"IF(B!M39=0,0,B!M39)","v":0}]
[null,null,null,null,null,null,null,"Subsistence allowance, no overnight stay",null,null,"1048/1085","Domestic",null,null,null,null,null,{"$f":"IF(AND(Q13<>0,M13<>\"\"),VLOOKUP(M13,'C'!C8:F10,4),\"\")","v":""},{"$f":"IF(AND(Q13<>0,M13<>\"\"),+Q13*R13,0)","v":0},null,null,null,null,null,null,null,"Beregner kostdøgn",{"$f":"T10-T9","v":0},1]
[null,null,null,null,null,null,null,null,null,null,1042,"Abroad. 6-12 timer",null,null,null,null,null,{"$f":"IF(M14<>0,((VLOOKUP(M14,'C'!$B$55:$E$221,4,FALSE))*0.5),\"\")","v":""},{"$f":"IF(M14<>0,+Q14*R14,0)","v":0},null,null,null,null,null,null,null,{"$f":"IF(AB13>0,(U10-U9)*24,0)","v":0},"Antall timer inn i nytt døgn"]
[null,null,null,null,null,null,null,null,null,null,1052,"Abroad > 12 timer",null,null,null,null,null,{"$f":"IF(M15<>0,((VLOOKUP(M15,'C'!$B$55:$E$221,4,FALSE))),\"\")","v":""},{"$f":"IF(M15<>0,+Q15*R15,0)","v":0},null,null,null,null,null,null,null,{"$f":"IF($AA$14>=6,1,0)","v":0},"Hvis 6 timer inn i nytt døgn, beregnes nytt kostdøgn"]
[null,null,null,null,null,null,null,"Subsistence allowance, overnight stay",null,null,"1087/1075","Hotell innland",{"$f":"IF($Q$16>0,'C'!G48*$Q16+Q42,\"\")","v":""},{"$f":"IF($Q16>0,(('C'!$F$12-'C'!$G48)*$Q16)+R42,\"\")","v":""},null,null,null,{"$f":"IF(Q16<>0,'C'!$F$12,\"\")","v":""},{"$f":"IF(Q16<>0,+Q16*R16,0)","v":0},null,null,null,null,null,null,null,{"$f":"V10","v":0},"Max. Beregnede kost døgn"]
[null,null,null,null,null,null,null,null,null,null,"1076/1075","B&B/Inn domestic *",{"$f":"IF($Q$17>0,'C'!F15*$Q17+Q43,\"\")","v":""},{"$f":"IF($Q17>0,(('C'!$F$12-'C'!$F$15)*$Q17)+R43,\"\")","v":""},null,null,null,{"$f":"IF(Q17<>0,'C'!F12,\"\")","v":""},0,null,null,null,null,null,null,null,{"$f":"SUM(Q13:Q22)","v":0},"sum oppgitte kostdøgn"]
[null,null,null,null,null,null,null,null,null,null,"1073/1075","Bedsit/AirBnB/ priv domestic*",{"$f":"IF($Q$18>0,('C'!F16*$Q18)+Q44,\"\")","v":""},{"$f":"IF($Q18>0,(('C'!$F$12-'C'!$F$16)*$Q18)+R44,\"\")","v":""},null,null,null,{"$f":"IF(Q18<>0,'C'!F12,\"\")","v":""},0,null,null,null,null,null,null,null,{"$f":"IF(Q13=1,0,AA16-AA17)","v":0},"Hvis negativt tall, Oppgitt for mange kostdøgn, skriver feilmelding"]
[null,null,null,null,null,null,null,null,null,null,1052,"Hotel abroad",null,null,null,null,null,{"$f":"IF(M19<>0,VLOOKUP(M19,'C'!$B$55:$E$221,4,FALSE),\"\")","v":""},0,null,null,null,null,null,null,null,{"$f":"IF($AA$14>=12,1,0)","v":0},"Hvis 12 timer inn i nytt døgn, beregnes nytt kostdøgn for kompetansetillegg"]
[null,null,null,null,null,null,null,null,null,null,1052,"Hotel abroad",null,null,null,null,null,{"$f":"IF(M20<>0,VLOOKUP(M20,'C'!$B$55:$E$221,4,FALSE),\"\")","v":""},0,null,null,null,null,null,null,null,"Hvis reisen varer mindre enn et døgn utbetales kompensasjonstillegg etter 12 timer"]
[null,null,null,null,null,null,null,{"$f":"IF(Q21>0,159*Q21,0)-Q43","v":0},{"$f":"IF(Q21>0,S21-H21,0)","v":0},null,"1076/1075","B&B/Inn abroad *",null,null,null,null,null,{"$f":"IF(M21<>0,VLOOKUP(M21,'C'!$B$55:$E$221,4,FALSE),\"\")","v":""},0,null,null,null,null,null,null,null,"Komp. Tillegg < 1 døgn",null,"kommentar","Hvis 12 timer inn i nytt døgn, får en nytt kompensasjonstilleggsdøgn ved reise under 12 timer"]
[null,null,null,null,null,null,null,{"$f":"IF(Q22>0,88*Q22,0)","v":0},{"$f":"IF(Q22>0,S22-H22,0)","v":0},null,"1073/1075","Bedsit/AirBnB/priv abroad*",null,null,null,null,null,{"$f":"IF(M22<>0,VLOOKUP(M22,'C'!$B$55:$E$221,4,FALSE),\"\")","v":""},0,null,null,null,null,null,null,null,{"$f":"T9","v":"00:00:00"},"Startdato",{"$f":"IF(AND(AC28=1,AC27>=12),1,0)","v":0},"Reisen varer under et døgn, men mer enn 12 timer = 1 (0 dersom mindre enn 12 timer)"]
[null,null,null,null,null,null,null,null,null,null,null,"Innland: utgår fom 2015",null,null,null,null,null,{"$f":"IF(Q23<>0,'C'!F6,\"\")","v":""},0,null,null,null,null,null,null,null,null,null,{"$f":"IF(AND(#REF!=1,AC28>=12),1,0)","v":{"$error":"#REF!"}}]
[null,null,null,null,null,null,null,"Night supplement",null,null,{"$f":"+'C'!A17","v":1053},"Domestic",null,null,null,null,null,{"$f":"IF(Q24<>0,'C'!F17,\"\")","v":""},0,null,null,null,null,null,null,null,{"$f":"$U$9*24","v":0},"start tidspunkt",{"$f":"AA25-AA24","v":0},"Antall timer mellom start-tidspukt og slutt-tidspunkt"]
[null,null,null,null,null,null,null,"Additional compensation ",null,null,{"$f":"+'C'!A13","v":1214},"Abroad*",null,{"$f":"IF(Q25>0,IF(AC28=1,AC22,AC32),\"\")","v":""},null,null,null,{"$f":"IF(Q25<>0,'C'!F13,\"\")","v":""},0,null,null,null,null,null,null,null,{"$f":"$U$10*24","v":0},"slutttidspunkt"]
[null,null,null,null,null,null,null,"Use of own means of transport. Please specify the journey on the reverse side.\n",null,null,{"$f":"'C'!A28","v":"1094/1096"},"Car  <10.000 km",{"$f":"'C'!C28*Q26","v":0},{"$f":"'C'!D28*Q26","v":0},null,null,null,{"$f":"'C'!F28","v":3.9},{"$f":"IF(Q26<>0,Q26*R26,0)","v":0}]
[null,null,null,null,null,null,null,null,null,null,"1202/1206","Car abroad <10.000 km",{"$f":"'C'!C30*Q27","v":0},{"$f":"'C'!D30*Q27","v":0},null,null,null,{"$f":"'C'!F30","v":3.9},{"$f":"IF(Q27<>0,Q27*R27,0)","v":0},null,null,null,null,null,null,null,{"$f":"IF(AC27>=12,\"Ja\",\"Nei\")","v":"Nei"},"sum",{"$f":"SUM(AC24:AC25)","v":0},"mer enn 12 timer totalt?"]
[null,null,null,null,null,null,null,null,null,null,{"$f":"'C'!A32","v":"1093/1095"},"EL-car <10.000 km",{"$f":"'C'!C32*Q28","v":0},{"$f":"'C'!D32*Q28","v":0},null,null,null,{"$f":"'C'!F32","v":3.9},0,null,null,null,null,null,null,null,null,"reisen varer antall døgn :",{"$f":"$T$10-$T$9","v":0}]
[null,null,null,null,null,null,null,null,null,null,"1203/1225","EL-car abroad <10.000 km",{"$f":"'C'!C34*Q29","v":0},{"$f":"'C'!D34*Q29","v":0},null,null,null,{"$f":"'C'!F34","v":3.9},0,null,null,null,null,null,null,null,null,"sum reg. døgn utland  :",{"$f":"SUM(Q19:Q22)","v":0},"Hvis reisen over et døgn utbetales kompensasjonstillegg etter 12 timer inn i nytt døgn"]
[null,null,null,null,null,null,null,null,null,null,{"$f":"'C'!A27","v":1045},"Passengers suppl.(name of passanger(s) should be entered  in the remarks box)",null,null,null,null,null,{"$f":"IF(Q30<>0,'C'!F27,\"\")","v":""},0,null,null,null,null,null,null,null,null,"Registrerte komp. Tillegg",{"$f":"Q25","v":0}]
[null,null,null,null,null,null,null,null,null,null,null,null,null,null,null,null,null,{"$f":"IF(Q31>0,'C'!F27,\"\")","v":""},0,null,null,null,null,null,null,null,null,"Beregnet komp.till under et døgn ",{"$f":"AC22","v":0},{"$f":"IF(Q25>AC31,\"Bruker har ikke krav på komp.tillegg for reise under 1 døgn\")","v":false}]
[null,null,null,null,null,null,null,null,null,null,{"$f":"IF(AND(M32<>\"\",Q32<>\"\"),VLOOKUP(M32,B!$E$71:$P$79,6,FALSE))","v":false},"Other",null,null,null,null,null,{"$f":"IF(AND(M32<>\"\",Q32<>0),VLOOKUP(M32,B!$E$71:$I$79,2,FALSE),\"\")","v":""},0,null,null,null,null,null,null,null,null,"Beregnet komp.till over et døgn ",{"$f":"IF(AC29<=$V$10,(AC29-1)+AA19,0)","v":-1},{"$f":"IF(AC32=0,\"Bruker har registrert for mange døgn utland enn startdato/sluttdato for reise tilsier\",\"ok\")","v":"ok"},"DENNE MÅ SJEKKES - BLIR FEIL HVIS BRUKER OPPGIR FEILE DØGN"]
[null,"sjekk at denne tabellen fungerer",null,null,null,null,null,"Stay exceeding 28 days\n ",null,null,1269,"Subsistence allowance domestic",null,null,null,null,null,{"$f":"IF(Q33<>0,'C'!$F$12*0.75,\"\")","v":""},0]
[null,null,null,null,null,null,null,null,null,null,1058,"Subsistence allowance abroad",null,null,null,null,null,{"$f":"IF(M34<>0,VLOOKUP(M34,'C'!$B$55:$E$221,4,FALSE)*0.75,\"\")","v":""},{"$f":"IF(M34<>0,+Q34*R34,0)","v":0},null,null,null,null,null,null,null,null,"Feilmelding komp tillegg under et døgn :",{"$f":"IF($Q$25>0,IF(AC22>=1,0,10))","v":false},{"$f":"IF(AC34=10, \"Feil - 10 Bruker har registrert komp tillegg men har ikke krav på under 1 døgn\",\"\")","v":""}]
[null,"Fratrekk for kost - satser",null,null,null,null,null,null,null,null,null,null,null,null,null,null,null,{"$f":"IF(Q35<>0,'C'!F17*0.75,\"\")","v":""},0,null,null,null,null,null,null,null,null,"Feilmelding komp tillegg over et døgn :",{"$f":"IF(AND($Q$25>0,$AC$29>=1),IF(AC32-Q25<0,20,0))","v":false},{"$f":"IF(AC35=20, \"Feil 20 - Bruker har registrert komp tillegg men har registrert flere enn han har krav på\",\"\")","v":""}]
[null,"% utland",0.2,0.3,0.5,null,null,"Other compensation",null,null,null,null,null,null,null,null,null,null,0]
[null,"% Innland",0.2,0.3,0.5,null,null,"Total",null,null,null,null,null,null,null,null,null,{"$f":"SUM($S$43:$S$44,$S$47:$S$48)","v":0},{"$f":"IF(SUM(S12:S36)<>0,SUM(S12:S36),0)","v":0}]
[null,"Sats","Frokost","Lunch","Middag","Sum",null,"Deduction for meals",null,null,null,"Breakfast","Lunch","Dinner",null,null,"Tax-free","Taxable"]
[{"$f":"L13","v":"Domestic"},{"$f":"IF(AND($Q$13>0,$M$13<>\"\"),VLOOKUP($M$13,'C'!$C$8:$F$9,4),0)","v":0},{"$f":"ROUND(IF(AND(B39<>0,L39>0),($C$37*754)*L39,0),0)","v":0},{"$f":"ROUND(IF(M39>0,(754*D37),0),0)","v":0},{"$f":"IF(N39>0,(754*E37),0)","v":0},{"$f":"IF(SUM(C39:E39)>B39,B39,SUM(C39:E39))","v":0},null,"No overnight stay",null,null,"1048/1085",null,null,null,null,null,null,null,{"$f":"-F39","v":0}]
[{"$f":"L14","v":"Abroad. 6-12 timer"},{"$f":"IF(AND($Q$14<>0,$M$14<>\"\"),VLOOKUP(M14,'C'!$B$55:$E$221,4,FALSE)*0.5,0)","v":0},{"$f":"IF(L40>0,($B40*C$36)*2,0)","v":0},{"$f":"IF(M40>0,($B40*D$36)*2,0)","v":0},{"$f":"IF(N40>0,($B40*E$36)*2,0)","v":0},{"$f":"SUM(C40:E40)","v":0},null,"Abroad 6-12 timer",null,null,1042,null,null,null,null,null,null,null,0]
{"$rows_left_out":41}
{"sheet":"B","index":1,"n_rows":79,"n_cols":22,"rows_kept":79,"cut":false,"hidden":false,"merged":[[52,0,57,12],[48,0,48,9],[29,1,29,7],[51,0,51,12],[35,1,35,7],[32,1,32,7],[42,1,42,8],[41,0,41,8],[44,1,44,8],[47,0,47,9],[49,0,49,9],[45,1,45,8],[43,1,43,8],[30,1,30,7],[41,9,41,11],[31,1,31,7],[12,2,12,3],[13,2,13,3],[23,9,23,11],[34,1,34,7],[33,1,33,7],[28,1,28,7],[24,1,24,7],[23,0,23,8],[25,1,25,7],[26,1,26,7],[27,1,27,7],[13,6,13,7],[12,6,12,7],[15,5,15,8],[15,2,15,4],[1,9,1,12],[6,2,6,3],[7,2,7,3],[9,2,9,3],[8,2,8,3],[4,6,4,7],[5,6,5,7],[6,6,6,7],[7,6,7,7],[5,2,5,3],[11,2,11,3],[2,6,2,7],[8,6,8,7],[9,6,9,7],[10,6,10,7],[11,6,11,7],[3,6,3,7],[10,2,10,3],[3,2,3,3],[4,2,4,3]]}
[]
["Journey specifications",null,null,null,null,null,null,null,null,"Expenses"]
["Date ","Time","From ",null,"To","Time","Means of transport",null,"Km","Currency","Amount","Exchange rate","Amount","Comments",null,"Sats","Skatte-fritt","Skatte-pliktig","Km","Sum km godtgj.","Kontr","Km"]
[null,null,null,null,null,null,null,null,null,null,null,null,{"$f":"IF(P4>0,T4,IF(AND(K4<>0,L4<>0),K4*L4,K4))","v":0},{"$f":"IF(AND(U4>4,I4=\"\"),\"Enter number of km\",\"\")","v":""},null,{"$f":"IF(G4=\"\",0,VLOOKUP($G4,$E$62:$F$79,2,FALSE))","v":0},{"$f":"IF(H4=\"\",0,VLOOKUP($G4,$E$62:$F$79,2,FALSE))","v":0},0,{"$f":"IF(U4>4,I4,0)","v":0},{"$f":"P4*S4","v":0},{"$f":"IF(G4=\"\",0,VLOOKUP($G4,$E$62:$I$79,5,FALSE))","v":0},{"$f":"IF(U4>4,I4,0)","v":0}]
[null,null,null,null,null,null,null,null,null,null,null,null,{"$f":"IF(P5>0,T5,IF(AND(K5<>0,L5<>0),K5*L5,K5))","v":0},"",null,{"$f":"IF(G5=\"\",0,VLOOKUP($G5,$E$62:$F$79,2,FALSE))","v":0},{"$f":"IF(H5=\"\",0,VLOOKUP($G5,$E$62:$F$79,2,FALSE))","v":0},{"$f":"IF(I5=\"\",0,VLOOKUP($G5,$E$62:$F$79,2,FALSE))","v":0},{"$f":"IF(U5>4,I5,0)","v":0},{"$f":"P5*S5","v":0},{"$f":"IF(G5=\"\",0,VLOOKUP($G5,$E$62:$I$79,5,FALSE))","v":0},{"$f":"IF(U5>4,I5,0)","v":0}]
[null,null,null,null,null,null,null,null,null,null,null,null,0,"",null,0,0,0,0,0,0,0]
[null,null,null,null,null,null,null,null,null,null,null,null,0,"",null,0,0,0,0,0,0,0]
[null,null,null,null,null,null,null,null,null,null,null,null,0,"",null,0,0,0,0,0,0,0]
[null,null,null,null,null,null,null,null,null,null,null,null,0,"",null,0,0,0,0,0,0,0]
[null,null,null,null,null,null,null,null,null,null,null,null,0,"",null,0,0,0,0,0,0,0]
[null,null,null,null,null,null,null,null,null,null,null,null,0,"",null,0,0,0,0,0,0,0]
[null,null,null,null,null,null,null,null,null,null,null,null,0,"",null,0,0,0,0,0,0,0]
[null,null,null,null,null,null,null,null,null,null,null,null,0,"",null,0,0,0,0,0,0,0]
[null,null,null,null,null,null,null,null,null,null,null,null,0,"",null,0,0,0,0,0,0,0]
[null,null,null,null,null,null,null,null,null,null,null,"Subtotal (not including comp. for use of own car)",{"$f":"IF(S15>0,SUM(M4:M14)-T15,SUM(M4:M14))","v":0},null,null,null,null,null,{"$f":"SUM(S4:S14)","v":0},{"$f":"SUM(T4:T14)","v":0},{"$f":"SUM(M4:M14)","v":0},{"$f":"SUM(V4:V14)","v":0}]
["Date: ",null,"Use of private car authorized by: ",null,null,null,null,null,null,null,null,null,null,null,null,null,null,null,null,"Sum km godtgj.",{"$f":"T15","v":0}]
[null,null,null,null,null,null,null,null,null,null,null,null,null,null,null,null,null,null,null,"Sum (eksk. km godtgj.)",{"$f":"U15-U16","v":0}]
[null,null,null,"Total km <10.000 km",null,{"$f":"SUMIF($G$4:$G$14,E67,$I$4:$I$14)","v":0},"Total km abroad <10.000 km",null,{"$f":"SUMIF($G$4:$G$14,E71,$I$4:$I$14)","v":0},"Total km moped <125ccm",null,null,{"$f":"SUMIF($G$4:$G$14,E76,$I$4:$I$14)","v":0}]
[null,null,null,"Total km  >10.000 km",null,{"$f":"SUMIF($G$4:$G$14,E68,$I$4:$I$14)","v":0},"Total km abroad >10.000 km",null,{"$f":"SUMIF($G$4:$G$14,E72,$I$4:$I$14)","v":0},"Total km motorcycle >125 ccm",null,null,{"$f":"SUMIF($G$4:$G$14,E77,$I$4:$I$14)","v":0},null,null,null,null,null,null,"Sum annet",{"$f":"SUM(M18:M21)","v":0}]
[null,null,null,"Total km El-car<10.000 km",null,{"$f":"SUMIF($G$4:$G$14,E69,$I$4:$I$14)","v":0},"Total km El-car abroad <10.000 km",null,{"$f":"SUMIF($G$4:$G$14,E73,$I$4:$I$14)","v":0},"Total km boat < 50 hk",null,null,{"$f":"SUMIF($G$4:$G$14,E78,$I$4:$I$14)","v":0},null,null,null,null,null,null,"Sum utland",{"$f":"SUM(I18:I21)","v":0}]
[null,null,null,"Total km El-car  >10.000 km",null,{"$f":"SUMIF($G$4:$G$14,E70,$I$4:$I$14)","v":0},"Total km El-car abroad  >10.000 km",null,{"$f":"SUMIF($G$4:$G$14,E74,$I$4:$I$14)","v":0},"Total km boat > 50hk",null,null,{"$f":"SUMIF($G$4:$G$14,E79,$I$4:$I$14)","v":0},null,null,null,null,null,null,"Totalt",{"$f":"SUM(U19:U20)","v":0}]
[null,null,null,"Total km to/from work",null,{"$f":"SUMIF($G$4:$G$14,E75,$I$4:$I$14)","v":0},"Total km passengers",null,{"$f":"SUMIF($G$4:$G$14,E66,$I$4:$I$14)","v":0},null,null,null,null,null,{"$f":"SUMIF($G$4:$G$14,#REF!,$I$4:$I$14)","v":0}]
[]
["Expenses for accommodation, food, toll, etc."]
["  Date","Description (If you stayed at a hotel, please specify the name and the address of the hotel)",null,null,null,null,null,null,"Paper receipts","Currency","Amount","Exchange rate","Amount"]
[null,null,null,null,null,null,null,null,null,null,null,null,{"$f":"IF(AND(K26<>0,L26<>0),K26*L26,K26)","v":0}]
[null,null,null,null,null,null,null,null,null,null,null,null,{"$f":"IF(AND(K27<>0,L27<>0),K27*L27,K27)","v":0}]
[null,null,null,null,null,null,null,null,null,null,null,null,0]
[null,null,null,null,null,null,null,null,null,null,null,null,0]
[null,null,null,null,null,null,null,null,null,null,null,null,0]
[null,null,null,null,null,null,null,null,null,null,null,null,0]
[null,null,null,null,null,null,null,null,null,null,null,null,0]
[null,null,null,null,null,null,null,null,null,null,null,null,0]
[null,null,null,null,null,null,null,null,null,null,null,null,0]
[null,null,null,null,null,null,null,null,null,null,null,null,0]
[null,null,null,null,null,null,null,null,null,null,null,null,0]
["   ","   ",null,null,null,null,null,null,null,null,null,"Subtotal",{"$f":"IF(SUM(M26:M36)<>0,SUM(M26:M36),0)","v":0}]
[]
[null,null,null,"Travel expenses - automatically transferred to the front page",null,null,null,null,null,null,null,"Total",{"$f":"IF(OR(M15<>0,M37<>0,M48<>0),M15+M37+M48,0)","v":0}]
[]
{"$rows_left_out":40}
{"sheet":"C","index":2,"n_rows":242,"n_cols":14,"rows_kept":242,"cut":false,"hidden":true,"merged":[[53,8,53,10],[53,11,53,13]]}
[]
[]
[]
[]
["TT-koder","      SATSTYPE",null,null,null,"Sats f.o.m 22.06.2018","Maks % av godtgjørelse","Kommentarer"]
["utgår","Administrativ forpleining (utgått 2015)",null,null,null,0,null,"Adminstrativ forpleining innland utgår fom 2015"]
["utgår","Administrativ forpleining utland (utgått 2016)",null,null,null,0,null,"Adminstrativ forpleining utland (kr 100 - fom 2015, utgår fra 1/1-2016)"]
[1048,"Innland, kostgodtgj. u/overnatting","6-12 hours",null,null,297,null,"Innenlands kostgodgjøring endret til 6 til 12 timer i 2015; ny sats fra 1/1-17 - 289,-"]
[1085,"Innland, kostgodgj. u/overnatting","over 12 hours",null,null,552,null,"over 12 timer; ny sats fra 1/1-17- 537,-"]
["utgår","Innland, kostgodgj. u/overnatting (utgått 2015)",null,null,null,0,null,"Kostgodtgjøring innland 9-12 timer utgår i 2015"]
[null,"Grense for legitimerte overnattingsutgifter, innland",null,null,null,1800]
[1087,"Innland, over 12 kostgodtgj m/overnatting","over 12 timer",null,null,754,null,"Per 1/1-2017 er dette kr.733,-"]
[1214,"Kompensasjonstillegg, utland",null,null,null,515,null,"Per 1/1-2017 er dette kr. 491,-"]
[]
[1076,"Trekkfri kostgodtgjørelse for pensjonat",null,null,null,159,null,"Her er kun kr. 315 (fra 2017) skattefritt, resten må det skattes av (gjelder både innland og utland)"]
[1073,"Trekkfri kostgodtgjørelse hybel/brakke/priv",null,null,null,88,null,"Her er kun kr. 205 (fra 2017) skattefritt, resten må det skattes av (gjelder både innland og utland)"]
[1053,"Innland, ulegitimertnattillegg",null,null,null,430]
[null,"Innland, kostgodtgjøring beordring 0-28 døgn",null,null,null,754,null,"Dette brukes ikke, men UiB bruker også kost utover 28 døgn (75%)- feltarbeid"]
[null,"Innland, ulegitimert overnatting beordring 0-28 døgn",null,null,null,430,null,"Dette brukes ikke, men UiB bruker også nattillegg 28 døgn (90%)- feltarbeid"]
[1269,"Kostgodtgjørelse beording over 28 døgn",null,null,null,195,null,"9.3 Særavtale for reiser utenlands for statens regning,  (kostgodtgjørelse reduseres med 25% av det landet de landet de er i)"]
[null,"Trekk, frokost innland dagreise",null,null,null,{"$f":"ROUND(20%*754,0)","v":151},null,"20% av 754"]
[null,"Trekk, lunsj, innland dagreise",null,null,null,{"$f":"ROUND(30%*754,0)","v":226},null,"30% av 754"]
[null,"Trekk, middag, innland dagreise",null,null,null,{"$f":"50%*754","v":377},null,"50% av 754"]
[null,"Trekk prosent frokost ",null,null,null,0.2]
[null,"Trekk prosent lunsj ",null,null,null,0.3]
[null,"Trekk prosent middag ",null,null,null,0.5]
[1045,"Passasjertillegg","Skattefritt","Skattepliktig",null,1]
["1094/1096","Bil km-godtgjørelse 0-10000 km",3.5,0.4,null,3.9]
[1097,"Bil km-godtgjørelse over 10000 km *",3.5,0.4,null,3.9]
["1202/1206","Bil utland: kilometergodtgjørelse < 10.000",3.5,0.4,null,3.9]
[1208,"Bil utland: kilometergodtgjørelse > 10.000",3.5,0.4,null,3.9]
["1093/1095","EL-bil km.godtgj. 0-10.000 km",3.5,0.4,null,3.9]
["1221/1223","EL-bil km.godtgj. > 10.000 km",3.5,0.4,null,3.9]
["1203/1225","EL-bil utland km.godtgj.  0-10.000 km",3.5,0.4,null,3.9]
[1222,"EL-bil utland km.godtgj.  > 10.000 km",3.5,0.4,null,3.9]
[1094,"Bil hjem - arbeid",{"$f":"F36","v":1.6},0,null,1.6]
[1061,"Moped < 125 ccm km. Godtgjørelse",{"$f":"F37","v":1.6},0,null,1.6]
[1063,"Motorsykkel >125 ccm km.godtgj. ",{"$f":"F38","v":2.95},0,null,2.95]
[1067,"Båt < 50 hk km.godtgj.",{"$f":"F39","v":4},0,null,4]
[1068,"Båt > 50 hk km.godtgj.",{"$f":"F40","v":7.5},0,null,7.5]
{"$rows_left_out":203}
{"sheet":"D","index":3,"n_rows":0,"n_cols":0,"rows_kept":0,"cut":false,"hidden":true,"merged":[]}

{"sheet":"Info","index":4,"n_rows":29,"n_cols":2,"rows_kept":29,"cut":false,"hidden":true,"merged":[]}
[]
[]
[null,"Hvordan korrigere satser, ev. skattefrie beløp"]
[]
["Beskyttelse","Regneboken som ligger ute er beskyttet mot endring i låste felt"]
[null,"Beskyttelsen må tas av (se makro for reiseregning)"]
[]
["C-arket","Alle satser som skal oppdateres korrigeres på side C (reiser, kjøregodtgjørelse mm)"]
[null,"Alle formler henviser til sater i dette regnearket, så når det er oppdatert her skal det være oppdatert i hele regnearket"]
[]
["B-arket","Satser og formler for beregninger ligger også i B-arket"]
[null,"Disse er skjult og må vises vha Vis-kommando"]
[null,"Marker start og slutt på kolonner som er skjult, høyre-klikk og velg vis"]
[null,"Beregner korrekt kjøregodkjørelse og plukklister for valg i listebokser"]
[]
["Datavalidering","Plukklistene er satt på vha Datavalidering"]
[null,"Marker området hvor det står listebokser, Velg Data på filmenyen"]
[null,"Da finner du verktøyet \"Datavalidering\" på dette båndet (se bilde)"]
[]
["A-arket","Dette arket inneholder også skjulte kolonner til venstre og høyre i skjemaet"]
[null,"Disse er skjult og må vises vha Vis-kommando"]
[null,"Beregner korrekt kostgodtgjørelse mm"]
[]
[]
[]
[]
[]
["Før ark legges ","Sett på arkbeskyttelse"]
["på web","Test at regnearket fungerer som det skal"]